bcachefs-tools CI

20af091a075bae03d83e41242c8c49f23a8fbfd1

jobstatusage
forky-ppc64el✗ failed13h23mlog
/usr/bin/x86_64-linux-gnu-ld.bfd: build/cstruct/fs.o: Relocations in generic ELF (EM: 21) /usr/bin/x86_64-linux-gnu-ld.bfd: build/cstruct/fs.o: error adding symbols: file in wrong format make[1]: *** [Makefile:360: build/cstruct/stamp] Error 1 make[1]: Leaving directory '/build/src' dh_auto_build: error: make -j16 INSTALL="install --strip-program=true" PKG_CONFIG=powerpc64le-linux-gnu-pkg-config CXX=powerpc64le-linux-gnu-g\+\+ CC=powerpc64le-linux-gnu-gcc returned exit code 2 make: *** [debian/rules:52: binary] Error 25 dpkg-buildpackage: error: debian/rules binary subprocess failed with exit status 2 ci-binary-forky-ppc64el-525443
plucky-amd64✗ failed13h14mlog
6 | enum AttributeRemoval { | ^^^^^^^^^^^^^^^^ make[1]: Leaving directory '/build/src' dh_auto_build: error: make -j16 "INSTALL=install --strip-program=true" returned exit code 2 make: *** [debian/rules:52: binary] Error 25 dpkg-buildpackage: error: debian/rules binary subprocess returned exit status 2 ci-binary-plucky-amd64-589461
plucky-arm64✗ failed12h46mlog
6 | enum AttributeRemoval { | ^^^^^^^^^^^^^^^^ make[1]: Leaving directory '/build/src' dh_auto_build: error: make -j16 "INSTALL=install --strip-program=true" returned exit code 2 make: *** [debian/rules:52: binary] Error 25 dpkg-buildpackage: error: debian/rules binary subprocess returned exit status 2 ci-binary-plucky-arm64-2347878
trixie-ppc64el✗ failed13h21mlog
ld: build/cstruct/fs.o: Relocations in generic ELF (EM: 21) ld: build/cstruct/fs.o: error adding symbols: file in wrong format make[1]: *** [Makefile:360: build/cstruct/stamp] Error 1 make[1]: Leaving directory '/build/src' dh_auto_build: error: make -j16 "INSTALL=install --strip-program=true" PKG_CONFIG=powerpc64le-linux-gnu-pkg-config CXX=powerpc64le-linux-gnu-g\+\+ CC=powerpc64le-linux-gnu-gcc returned exit code 2 make: *** [debian/rules:52: binary] Error 25 dpkg-buildpackage: error: debian/rules binary subprocess returned exit status 2 ci-binary-trixie-ppc64el-539503
unstable-ppc64el✗ failed13h29mlog
/usr/bin/x86_64-linux-gnu-ld.bfd: build/cstruct/fs.o: Relocations in generic ELF (EM: 21) /usr/bin/x86_64-linux-gnu-ld.bfd: build/cstruct/fs.o: error adding symbols: file in wrong format make[1]: *** [Makefile:360: build/cstruct/stamp] Error 1 make[1]: Leaving directory '/build/src' dh_auto_build: error: make -j16 INSTALL="install --strip-program=true" PKG_CONFIG=powerpc64le-linux-gnu-pkg-config CC=powerpc64le-linux-gnu-gcc returned exit code 2 make: *** [debian/rules:52: binary] Error 25 dpkg-buildpackage: error: debian/rules binary subprocess failed with exit status 2 ci-binary-unstable-ppc64el-477281
forky-amd64✓ done13h24mlog
forky-arm64✓ done13h15mlog
publish✓ done12h45mlog
questing-amd64✓ done13h14mlog
questing-arm64✓ done12h50mlog
resolute-amd64✓ done13h16mlog
resolute-arm64✓ done12h59mlog
source✓ done13h31mlog
trixie-amd64✓ done13h19mlog
trixie-arm64✓ done13h07mlog
unstable-amd64✓ done13h25mlog
unstable-arm64✓ done13h23mlog

12/17 done, 5 failed

bb7b4816edb889e94ddf3b68e9f6e47580842216

jobstatusage
forky-ppc64el✗ failed20h18mlog
/usr/bin/x86_64-linux-gnu-ld.bfd: build/cstruct/fs.o: Relocations in generic ELF (EM: 21) /usr/bin/x86_64-linux-gnu-ld.bfd: build/cstruct/fs.o: error adding symbols: file in wrong format make[1]: *** [Makefile:360: build/cstruct/stamp] Error 1 make[1]: Leaving directory '/build/src' dh_auto_build: error: make -j16 INSTALL="install --strip-program=true" PKG_CONFIG=powerpc64le-linux-gnu-pkg-config CXX=powerpc64le-linux-gnu-g\+\+ CC=powerpc64le-linux-gnu-gcc returned exit code 2 make: *** [debian/rules:52: binary] Error 25 dpkg-buildpackage: error: debian/rules binary subprocess failed with exit status 2 ci-binary-forky-ppc64el-3289758
plucky-amd64✗ failed20h10mlog
6 | enum AttributeRemoval { | ^^^^^^^^^^^^^^^^ make[1]: Leaving directory '/build/src' dh_auto_build: error: make -j16 "INSTALL=install --strip-program=true" returned exit code 2 make: *** [debian/rules:52: binary] Error 25 dpkg-buildpackage: error: debian/rules binary subprocess returned exit status 2 ci-binary-plucky-amd64-3336710
plucky-arm64✗ failed19h39mlog
6 | enum AttributeRemoval { | ^^^^^^^^^^^^^^^^ make[1]: Leaving directory '/build/src' dh_auto_build: error: make -j16 "INSTALL=install --strip-program=true" returned exit code 2 make: *** [debian/rules:52: binary] Error 25 dpkg-buildpackage: error: debian/rules binary subprocess returned exit status 2 ci-binary-plucky-arm64-1351040
trixie-ppc64el✗ failed20h16mlog
ld: build/cstruct/fs.o: Relocations in generic ELF (EM: 21) ld: build/cstruct/fs.o: error adding symbols: file in wrong format make[1]: *** [Makefile:360: build/cstruct/stamp] Error 1 make[1]: Leaving directory '/build/src' dh_auto_build: error: make -j16 "INSTALL=install --strip-program=true" PKG_CONFIG=powerpc64le-linux-gnu-pkg-config CXX=powerpc64le-linux-gnu-g\+\+ CC=powerpc64le-linux-gnu-gcc returned exit code 2 make: *** [debian/rules:52: binary] Error 25 dpkg-buildpackage: error: debian/rules binary subprocess returned exit status 2 ci-binary-trixie-ppc64el-3298206
unstable-ppc64el✗ failed20h22mlog
/usr/bin/x86_64-linux-gnu-ld.bfd: build/cstruct/fs.o: Relocations in generic ELF (EM: 21) /usr/bin/x86_64-linux-gnu-ld.bfd: build/cstruct/fs.o: error adding symbols: file in wrong format make[1]: *** [Makefile:360: build/cstruct/stamp] Error 1 make[1]: Leaving directory '/build/src' dh_auto_build: error: make -j16 INSTALL="install --strip-program=true" PKG_CONFIG=powerpc64le-linux-gnu-pkg-config CC=powerpc64le-linux-gnu-gcc returned exit code 2 make: *** [debian/rules:52: binary] Error 25 dpkg-buildpackage: error: debian/rules binary subprocess failed with exit status 2 ci-binary-unstable-ppc64el-3262493
forky-amd64✓ done20h18mlog
forky-arm64✓ done20h08mlog
publish✓ done19h38mlog
questing-amd64✓ done20h10mlog
questing-arm64✓ done19h43mlog
resolute-amd64✓ done20h12mlog
resolute-arm64✓ done19h52mlog
source✓ done20h24mlog
trixie-amd64✓ done20h14mlog
trixie-arm64✓ done20h00mlog
unstable-amd64✓ done20h20mlog
unstable-arm64✓ done20h16mlog

12/17 done, 5 failed

1507ece16ce673fae8b2dd578d1be6b463e6d650

jobstatusage
forky-ppc64el✗ failed41h42mlog
/usr/bin/x86_64-linux-gnu-ld.bfd: build/cstruct/fs.o: Relocations in generic ELF (EM: 21) /usr/bin/x86_64-linux-gnu-ld.bfd: build/cstruct/fs.o: error adding symbols: file in wrong format make[1]: *** [Makefile:360: build/cstruct/stamp] Error 1 make[1]: Leaving directory '/build/src' dh_auto_build: error: make -j16 INSTALL="install --strip-program=true" PKG_CONFIG=powerpc64le-linux-gnu-pkg-config CXX=powerpc64le-linux-gnu-g\+\+ CC=powerpc64le-linux-gnu-gcc returned exit code 2 make: *** [debian/rules:52: binary] Error 25 dpkg-buildpackage: error: debian/rules binary subprocess failed with exit status 2 ci-binary-forky-ppc64el-3588646
plucky-amd64✗ failed41h34mlog
6 | enum AttributeRemoval { | ^^^^^^^^^^^^^^^^ make[1]: Leaving directory '/build/src' dh_auto_build: error: make -j16 "INSTALL=install --strip-program=true" returned exit code 2 make: *** [debian/rules:52: binary] Error 25 dpkg-buildpackage: error: debian/rules binary subprocess returned exit status 2 ci-binary-plucky-amd64-3634568
plucky-arm64✗ failed41h04mlog
6 | enum AttributeRemoval { | ^^^^^^^^^^^^^^^^ make[1]: Leaving directory '/build/src' dh_auto_build: error: make -j16 "INSTALL=install --strip-program=true" returned exit code 2 make: *** [debian/rules:52: binary] Error 25 dpkg-buildpackage: error: debian/rules binary subprocess returned exit status 2 ci-binary-plucky-arm64-1589691
trixie-ppc64el✗ failed41h40mlog
ld: build/cstruct/fs.o: Relocations in generic ELF (EM: 21) ld: build/cstruct/fs.o: error adding symbols: file in wrong format make[1]: *** [Makefile:360: build/cstruct/stamp] Error 1 make[1]: Leaving directory '/build/src' dh_auto_build: error: make -j16 "INSTALL=install --strip-program=true" PKG_CONFIG=powerpc64le-linux-gnu-pkg-config CXX=powerpc64le-linux-gnu-g\+\+ CC=powerpc64le-linux-gnu-gcc returned exit code 2 make: *** [debian/rules:52: binary] Error 25 dpkg-buildpackage: error: debian/rules binary subprocess returned exit status 2 ci-binary-trixie-ppc64el-3598229
unstable-ppc64el✗ failed41h46mlog
/usr/bin/x86_64-linux-gnu-ld.bfd: build/cstruct/fs.o: Relocations in generic ELF (EM: 21) /usr/bin/x86_64-linux-gnu-ld.bfd: build/cstruct/fs.o: error adding symbols: file in wrong format make[1]: Leaving directory '/build/src' make[1]: *** [Makefile:360: build/cstruct/stamp] Error 1 dh_auto_build: error: make -j16 INSTALL="install --strip-program=true" PKG_CONFIG=powerpc64le-linux-gnu-pkg-config CC=powerpc64le-linux-gnu-gcc returned exit code 2 make: *** [debian/rules:52: binary] Error 25 dpkg-buildpackage: error: debian/rules binary subprocess failed with exit status 2 ci-binary-unstable-ppc64el-3559619
forky-amd64✓ done41h42mlog
forky-arm64✓ done41h32mlog
publish✓ done41h03mlog
questing-amd64✓ done41h34mlog
questing-arm64✓ done41h08mlog
resolute-amd64✓ done41h36mlog
resolute-arm64✓ done41h16mlog
source✓ done41h48mlog
trixie-amd64✓ done41h38mlog
trixie-arm64✓ done41h24mlog
unstable-amd64✓ done41h44mlog
unstable-arm64✓ done41h40mlog

12/17 done, 5 failed

7bd1dccf030ae3d953e449402ec58190e04967a8

jobstatusage
forky-ppc64el✗ failed45h10mlog
/usr/bin/x86_64-linux-gnu-ld.bfd: build/cstruct/fs.o: Relocations in generic ELF (EM: 21) /usr/bin/x86_64-linux-gnu-ld.bfd: build/cstruct/fs.o: error adding symbols: file in wrong format make[1]: *** [Makefile:360: build/cstruct/stamp] Error 1 make[1]: Leaving directory '/build/src' dh_auto_build: error: make -j16 INSTALL="install --strip-program=true" PKG_CONFIG=powerpc64le-linux-gnu-pkg-config CXX=powerpc64le-linux-gnu-g\+\+ CC=powerpc64le-linux-gnu-gcc returned exit code 2 make: *** [debian/rules:52: binary] Error 25 dpkg-buildpackage: error: debian/rules binary subprocess failed with exit status 2 ci-binary-forky-ppc64el-2943912
plucky-amd64✗ failed45h03mlog
6 | enum AttributeRemoval { | ^^^^^^^^^^^^^^^^ make[1]: Leaving directory '/build/src' dh_auto_build: error: make -j16 "INSTALL=install --strip-program=true" returned exit code 2 make: *** [debian/rules:52: binary] Error 25 dpkg-buildpackage: error: debian/rules binary subprocess returned exit status 2 ci-binary-plucky-amd64-2990057
plucky-arm64✗ failed44h31mlog
6 | enum AttributeRemoval { | ^^^^^^^^^^^^^^^^ make[1]: Leaving directory '/build/src' dh_auto_build: error: make -j16 "INSTALL=install --strip-program=true" returned exit code 2 make: *** [debian/rules:52: binary] Error 25 dpkg-buildpackage: error: debian/rules binary subprocess returned exit status 2 ci-binary-plucky-arm64-3071052
trixie-ppc64el✗ failed45h08mlog
ld: build/cstruct/fs.o: Relocations in generic ELF (EM: 21) ld: build/cstruct/fs.o: error adding symbols: file in wrong format make[1]: Leaving directory '/build/src' make[1]: *** [Makefile:360: build/cstruct/stamp] Error 1 dh_auto_build: error: make -j16 "INSTALL=install --strip-program=true" PKG_CONFIG=powerpc64le-linux-gnu-pkg-config CXX=powerpc64le-linux-gnu-g\+\+ CC=powerpc64le-linux-gnu-gcc returned exit code 2 make: *** [debian/rules:52: binary] Error 25 dpkg-buildpackage: error: debian/rules binary subprocess returned exit status 2 ci-binary-trixie-ppc64el-2952398
unstable-ppc64el✗ failed45h14mlog
/usr/bin/x86_64-linux-gnu-ld.bfd: build/cstruct/fs.o: Relocations in generic ELF (EM: 21) /usr/bin/x86_64-linux-gnu-ld.bfd: build/cstruct/fs.o: error adding symbols: file in wrong format make[1]: *** [Makefile:360: build/cstruct/stamp] Error 1 make[1]: Leaving directory '/build/src' dh_auto_build: error: make -j16 INSTALL="install --strip-program=true" PKG_CONFIG=powerpc64le-linux-gnu-pkg-config CC=powerpc64le-linux-gnu-gcc returned exit code 2 make: *** [debian/rules:52: binary] Error 25 dpkg-buildpackage: error: debian/rules binary subprocess failed with exit status 2 ci-binary-unstable-ppc64el-2912395
forky-amd64✓ done45h10mlog
forky-arm64✓ done45h00mlog
publish✓ done44h30mlog
questing-amd64✓ done45h02mlog
questing-arm64✓ done44h35mlog
resolute-amd64✓ done45h04mlog
resolute-arm64✓ done44h44mlog
source✓ done45h16mlog
trixie-amd64✓ done45h06mlog
trixie-arm64✓ done44h52mlog
unstable-amd64✓ done45h12mlog
unstable-arm64✓ done45h08mlog

12/17 done, 5 failed

97c3bf4a6a33a2b518be69bce3799027f27458b5

jobstatusage
forky-ppc64el✗ failed91h16mlog
/usr/bin/x86_64-linux-gnu-ld.bfd: build/cstruct/fs.o: Relocations in generic ELF (EM: 21) /usr/bin/x86_64-linux-gnu-ld.bfd: build/cstruct/fs.o: error adding symbols: file in wrong format make[1]: *** [Makefile:360: build/cstruct/stamp] Error 1 make[1]: Leaving directory '/build/src' dh_auto_build: error: make -j16 INSTALL="install --strip-program=true" PKG_CONFIG=powerpc64le-linux-gnu-pkg-config CXX=powerpc64le-linux-gnu-g\+\+ CC=powerpc64le-linux-gnu-gcc returned exit code 2 make: *** [debian/rules:52: binary] Error 25 dpkg-buildpackage: error: debian/rules binary subprocess failed with exit status 2 ci-binary-forky-ppc64el-1638984
plucky-amd64✗ failed91h09mlog
6 | enum AttributeRemoval { | ^^^^^^^^^^^^^^^^ make[1]: Leaving directory '/build/src' dh_auto_build: error: make -j16 "INSTALL=install --strip-program=true" returned exit code 2 make: *** [debian/rules:52: binary] Error 25 dpkg-buildpackage: error: debian/rules binary subprocess returned exit status 2 ci-binary-plucky-amd64-1674580
plucky-arm64✗ failed90h40mlog
6 | enum AttributeRemoval { | ^^^^^^^^^^^^^^^^ make[1]: Leaving directory '/build/src' dh_auto_build: error: make -j16 "INSTALL=install --strip-program=true" returned exit code 2 make: *** [debian/rules:52: binary] Error 25 dpkg-buildpackage: error: debian/rules binary subprocess returned exit status 2 ci-binary-plucky-arm64-3870381
trixie-amd64✗ failed91h14mlog
make[1]: *** [Makefile:279: build/c_src/tools-util.o] Error 1 make[1]: *** [Makefile:279: build/fs/alloc/check.o] Error 1 make[1]: *** [Makefile:279: build/c_src/rust_shims.o] Error 1 make[1]: Leaving directory '/build/src' dh_auto_build: error: make -j16 "INSTALL=install --strip-program=true" returned exit code 2 make: *** [debian/rules:52: binary] Error 25 dpkg-buildpackage: error: debian/rules binary subprocess returned exit status 2 ci-binary-trixie-amd64-1646505
trixie-arm64✗ failed91h01mlog
make[1]: *** [Makefile:279: build/fs/alloc/buckets.o] Error 1 make[1]: *** [Makefile:279: build/fs/alloc/background.o] Error 1 make[1]: Leaving directory '/build/src' make[1]: *** [Makefile:279: build/fs/alloc/backpointers.o] Error 1 dh_auto_build: error: make -j16 "INSTALL=install --strip-program=true" returned exit code 2 make: *** [debian/rules:52: binary] Error 25 dpkg-buildpackage: error: debian/rules binary subprocess returned exit status 2 ci-binary-trixie-arm64-3629474
trixie-ppc64el✗ failed91h14mlog
ld: build/cstruct/fs.o: Relocations in generic ELF (EM: 21) ld: build/cstruct/fs.o: error adding symbols: file in wrong format make[1]: *** [Makefile:360: build/cstruct/stamp] Error 1 make[1]: Leaving directory '/build/src' dh_auto_build: error: make -j16 "INSTALL=install --strip-program=true" PKG_CONFIG=powerpc64le-linux-gnu-pkg-config CXX=powerpc64le-linux-gnu-g\+\+ CC=powerpc64le-linux-gnu-gcc returned exit code 2 make: *** [debian/rules:52: binary] Error 25 dpkg-buildpackage: error: debian/rules binary subprocess returned exit status 2 ci-binary-trixie-ppc64el-1646529
unstable-ppc64el✗ failed91h20mlog
/usr/bin/x86_64-linux-gnu-ld.bfd: build/cstruct/fs.o: Relocations in generic ELF (EM: 21) /usr/bin/x86_64-linux-gnu-ld.bfd: build/cstruct/fs.o: Relocations in generic ELF (EM: 21) /usr/bin/x86_64-linux-gnu-ld.bfd: build/cstruct/fs.o: error adding symbols: file in wrong format make[1]: *** [Makefile:360: build/cstruct/stamp] Error 1 dh_auto_build: error: make -j16 INSTALL="install --strip-program=true" PKG_CONFIG=powerpc64le-linux-gnu-pkg-config CC=powerpc64le-linux-gnu-gcc returned exit code 2 make: *** [debian/rules:52: binary] Error 25 dpkg-buildpackage: error: debian/rules binary subprocess failed with exit status 2 ci-binary-unstable-ppc64el-1609667
forky-amd64✓ done91h16mlog
forky-arm64✓ done91h06mlog
publish✓ done90h39mlog
questing-amd64✓ done91h10mlog
questing-arm64✓ done90h44mlog
resolute-amd64✓ done91h10mlog
resolute-arm64✓ done90h52mlog
source✓ done91h22mlog
unstable-amd64✓ done91h18mlog
unstable-arm64✓ done91h14mlog

10/17 done, 7 failed

efec39c7e8d1dda11fb16bad0e1e75d86ead3105

jobstatusage
forky-ppc64el✗ failed132h56mlog
/usr/bin/x86_64-linux-gnu-ld.bfd: build/cstruct/fs.o: Relocations in generic ELF (EM: 21) /usr/bin/x86_64-linux-gnu-ld.bfd: build/cstruct/fs.o: error adding symbols: file in wrong format make[1]: *** [Makefile:360: build/cstruct/stamp] Error 1 make[1]: Leaving directory '/build/src' dh_auto_build: error: make -j16 INSTALL="install --strip-program=true" PKG_CONFIG=powerpc64le-linux-gnu-pkg-config CXX=powerpc64le-linux-gnu-g\+\+ CC=powerpc64le-linux-gnu-gcc returned exit code 2 make: *** [debian/rules:52: binary] Error 25 dpkg-buildpackage: error: debian/rules binary subprocess failed with exit status 2 ci-binary-forky-ppc64el-3853406
plucky-amd64✗ failed132h48mlog
327 | pub(crate) use c_opaque; | ^^^^^^^^ make[1]: Leaving directory '/build/src' dh_auto_build: error: make -j16 "INSTALL=install --strip-program=true" returned exit code 2 make: *** [debian/rules:52: binary] Error 25 dpkg-buildpackage: error: debian/rules binary subprocess returned exit status 2 ci-binary-plucky-amd64-3899386
plucky-arm64✗ failed132h16mlog
327 | pub(crate) use c_opaque; | ^^^^^^^^ make[1]: Leaving directory '/build/src' dh_auto_build: error: make -j16 "INSTALL=install --strip-program=true" returned exit code 2 make: *** [debian/rules:52: binary] Error 25 dpkg-buildpackage: error: debian/rules binary subprocess returned exit status 2 ci-binary-plucky-arm64-3645661
trixie-ppc64el✗ failed132h54mlog
ld: build/cstruct/fs.o: Relocations in generic ELF (EM: 21) ld: build/cstruct/fs.o: error adding symbols: file in wrong format make[1]: *** [Makefile:360: build/cstruct/stamp] Error 1 dh_auto_build: error: make -j16 "INSTALL=install --strip-program=true" PKG_CONFIG=powerpc64le-linux-gnu-pkg-config CXX=powerpc64le-linux-gnu-g\+\+ CC=powerpc64le-linux-gnu-gcc returned exit code 2 make[1]: Leaving directory '/build/src' make: *** [debian/rules:52: binary] Error 25 dpkg-buildpackage: error: debian/rules binary subprocess returned exit status 2 ci-binary-trixie-ppc64el-3861824
unstable-ppc64el✗ failed133h01mlog
/usr/bin/x86_64-linux-gnu-ld.bfd: build/cstruct/fs.o: Relocations in generic ELF (EM: 21) /usr/bin/x86_64-linux-gnu-ld.bfd: build/cstruct/fs.o: error adding symbols: file in wrong format make[1]: *** [Makefile:360: build/cstruct/stamp] Error 1 make[1]: Leaving directory '/build/src' dh_auto_build: error: make -j16 INSTALL="install --strip-program=true" PKG_CONFIG=powerpc64le-linux-gnu-pkg-config CC=powerpc64le-linux-gnu-gcc returned exit code 2 make: *** [debian/rules:52: binary] Error 25 dpkg-buildpackage: error: debian/rules binary subprocess failed with exit status 2 ci-binary-unstable-ppc64el-3819029
forky-amd64✓ done132h56mlog
forky-arm64✓ done132h47mlog
publish✓ done132h15mlog
questing-amd64✓ done132h46mlog
questing-arm64✓ done132h20mlog
resolute-amd64✓ done132h49mlog
resolute-arm64✓ done132h29mlog
source✓ done133h03mlog
trixie-amd64✓ done132h51mlog
trixie-arm64✓ done132h38mlog
unstable-amd64✓ done132h58mlog
unstable-arm64✓ done132h55mlog

12/17 done, 5 failed

1a3cee9946020dd9e8e7e9181a9901b5d4233d74

jobstatusage
resolute-arm64✗ failed184h40mlog
warning: bcachefs-shim@0.1.0: Inherited flag "-fno-omit-frame-pointer" is not supported by the currently used CC warning: bch_bindgen@0.1.0: Inherited flag "-fno-omit-frame-pointer" is not supported by the currently used CC Finished `release` profile [optimized + debuginfo] target(s) in 0.12s make[1]: Leaving directory '/build/src' dh_auto_install: error: make -j16 install DESTDIR=/build/src/debian/tmp AM_UPDATE_INFO_DIR=no INSTALL="install --strip-program=true" returned exit code 2 make: *** [debian/rules:52: binary] Error 25 dpkg-buildpackage: error: debian/rules binary subprocess failed with exit status 2 ci-binary-resolute-arm64-865205
plucky-arm64· pending185h05m
publish· pending185h05m
forky-amd64✓ done184h59mlog
forky-arm64✓ done184h51mlog
forky-ppc64el✓ done184h57mlog
plucky-amd64✓ done184h52mlog
questing-amd64✓ done184h51mlog
questing-arm64✓ done184h33mlog
resolute-amd64✓ done184h54mlog
source✓ done185h04mlog
trixie-amd64✓ done184h57mlog
trixie-arm64✓ done184h45mlog
trixie-ppc64el✓ done184h54mlog
unstable-amd64✓ done185h01mlog
unstable-arm64✓ done184h57mlog
unstable-ppc64el✓ done185h00mlog

14/17 done, 1 failed

2145ca544cb179a9d8fc867deb7fe082dc635abd

jobstatusage
resolute-arm64✗ failed215h36mlog
warning: bcachefs-shim@0.1.0: Inherited flag "-fno-omit-frame-pointer" is not supported by the currently used CC warning: bch_bindgen@0.1.0: Inherited flag "-fno-omit-frame-pointer" is not supported by the currently used CC Finished `release` profile [optimized + debuginfo] target(s) in 0.12s make[1]: Leaving directory '/build/src' dh_auto_install: error: make -j16 install DESTDIR=/build/src/debian/tmp AM_UPDATE_INFO_DIR=no INSTALL="install --strip-program=true" returned exit code 2 make: *** [debian/rules:52: binary] Error 25 dpkg-buildpackage: error: debian/rules binary subprocess failed with exit status 2 ci-binary-resolute-arm64-3546816
forky-amd64✓ done215h53mlog
forky-arm64✓ done215h47mlog
forky-ppc64el✓ done215h52mlog
plucky-amd64✓ done215h45mlog
plucky-arm64✓ done215h23mlog
publish✓ done215h22mlog
questing-amd64✓ done215h46mlog
questing-arm64✓ done215h29mlog
resolute-amd64✓ done215h47mlog
source✓ done215h59mlog
trixie-amd64✓ done215h50mlog
trixie-arm64✓ done215h41mlog
trixie-ppc64el✓ done215h49mlog
unstable-amd64✓ done215h56mlog
unstable-arm64✓ done215h53mlog
unstable-ppc64el✓ done215h55mlog

16/17 done, 1 failed

e632f69539c7fabf07fdfe051a1f8483427eb2b4

jobstatusage
resolute-arm64✗ failed277h34mlog
make[1]: *** [Makefile:414: install_systemd] Error 1 make[1]: *** Waiting for unfinished jobs.... Finished `release` profile [optimized + debuginfo] target(s) in 0.12s make[1]: Leaving directory '/build/src' dh_auto_install: error: make -j16 install DESTDIR=/build/src/debian/tmp AM_UPDATE_INFO_DIR=no INSTALL="install --strip-program=true" returned exit code 2 make: *** [debian/rules:52: binary] Error 25 dpkg-buildpackage: error: debian/rules binary subprocess failed with exit status 2 ci-binary-resolute-arm64-1777799
forky-amd64✓ done277h51mlog
forky-arm64✓ done277h45mlog
forky-ppc64el✓ done277h50mlog
plucky-amd64✓ done277h43mlog
plucky-arm64✓ done277h21mlog
publish✓ done277h20mlog
questing-amd64✓ done277h45mlog
questing-arm64✓ done277h27mlog
resolute-amd64✓ done277h45mlog
source✓ done277h57mlog
trixie-amd64✓ done277h48mlog
trixie-arm64✓ done277h39mlog
trixie-ppc64el✓ done277h47mlog
unstable-amd64✓ done277h54mlog
unstable-arm64✓ done277h51mlog
unstable-ppc64el✓ done277h53mlog

16/17 done, 1 failed

1baf29d9d661aea561d1e73c0303aba9b4cbefbd

jobstatusage
plucky-arm64· pending331h01m
publish· pending331h01m
forky-amd64✓ done330h54mlog
forky-arm64✓ done330h44mlog
forky-ppc64el✓ done330h52mlog
plucky-amd64✓ done330h46mlog
questing-amd64✓ done330h46mlog
questing-arm64✓ done330h26mlog
resolute-amd64✓ done330h49mlog
resolute-arm64✓ done330h32mlog
source✓ done331h00mlog
trixie-amd64✓ done330h52mlog
trixie-arm64✓ done330h38mlog
trixie-ppc64el✓ done330h48mlog
unstable-amd64✓ done330h57mlog
unstable-arm64✓ done330h50mlog
unstable-ppc64el✓ done330h56mlog

15/17 done

1bd5beff0faf2dfecd1ed17c8407f577b2288b75

jobstatusage
plucky-arm64· pending331h21m
publish· pending331h21m
questing-arm64· pending331h21m
forky-amd64✓ done331h14mlog
forky-arm64✓ done331h08mlog
forky-ppc64el✓ done331h12mlog
plucky-amd64✓ done331h06mlog
questing-amd64✓ done331h06mlog
resolute-amd64✓ done331h09mlog
resolute-arm64✓ done330h56mlog
source✓ done331h20mlog
trixie-amd64✓ done331h12mlog
trixie-arm64✓ done331h02mlog
trixie-ppc64el✓ done331h08mlog
unstable-amd64✓ done331h17mlog
unstable-arm64✓ done331h14mlog
unstable-ppc64el✓ done331h16mlog

14/17 done

67f0a6567b1e5ba24247312ece038ac65a8c2958

jobstatusage
forky-amd64✓ done142h31mlog
forky-arm64✓ done142h25mlog
forky-ppc64el✓ done142h30mlog
plucky-amd64✓ done142h23mlog
plucky-arm64✓ done142h01mlog
publish✓ done142h00mlog
questing-amd64✓ done142h25mlog
questing-arm64✓ done142h07mlog
resolute-amd64✓ done142h25mlog
resolute-arm64✓ done142h13mlog
source✓ done142h37mlog
trixie-amd64✓ done142h28mlog
trixie-arm64✓ done142h19mlog
trixie-ppc64el✓ done142h27mlog
unstable-amd64✓ done142h34mlog
unstable-arm64✓ done142h31mlog
unstable-ppc64el✓ done142h33mlog

17/17 done

a8b0f5e8555575f6181e9c95e07d487e81b44963

jobstatusage
forky-amd64✓ done184h30mlog
forky-arm64✓ done184h20mlog
forky-ppc64el✓ done184h30mlog
plucky-amd64✓ done184h23mlog
plucky-arm64✓ done183h56mlog
publish✓ done183h55mlog
questing-amd64✓ done184h23mlog
questing-arm64✓ done184h02mlog
resolute-amd64✓ done184h25mlog
resolute-arm64✓ done184h08mlog
source✓ done184h36mlog
trixie-amd64✓ done184h27mlog
trixie-arm64✓ done184h14mlog
trixie-ppc64el✓ done184h26mlog
unstable-amd64✓ done184h33mlog
unstable-arm64✓ done184h26mlog
unstable-ppc64el✓ done184h33mlog

17/17 done

289ae7df379b383fd3bc1e85b6f5db476fa991c5

jobstatusage
forky-amd64✓ done194h32mlog
forky-arm64✓ done194h26mlog
forky-ppc64el✓ done194h31mlog
plucky-amd64✓ done194h24mlog
plucky-arm64✓ done194h02mlog
publish✓ done194h01mlog
questing-amd64✓ done194h25mlog
questing-arm64✓ done194h08mlog
resolute-amd64✓ done194h26mlog
resolute-arm64✓ done194h14mlog
source✓ done194h38mlog
trixie-amd64✓ done194h29mlog
trixie-arm64✓ done194h20mlog
trixie-ppc64el✓ done194h28mlog
unstable-amd64✓ done194h35mlog
unstable-arm64✓ done194h32mlog
unstable-ppc64el✓ done194h34mlog

17/17 done

915c4e151407bf99ede7569d22894ab8c44440c3

jobstatusage
forky-amd64✓ done230h00mlog
forky-arm64✓ done229h55mlog
forky-ppc64el✓ done230h00mlog
plucky-amd64✓ done229h53mlog
plucky-arm64✓ done229h31mlog
publish✓ done229h30mlog
questing-amd64✓ done229h53mlog
questing-arm64✓ done229h37mlog
resolute-amd64✓ done229h55mlog
resolute-arm64✓ done229h43mlog
source✓ done230h07mlog
trixie-amd64✓ done229h57mlog
trixie-arm64✓ done229h49mlog
trixie-ppc64el✓ done229h56mlog
unstable-amd64✓ done230h03mlog
unstable-arm64✓ done230h01mlog
unstable-ppc64el✓ done230h03mlog

17/17 done

4aaceb395dca4762e3915b4a0e2971598535d640

jobstatusage
forky-amd64✓ done233h15mlog
forky-arm64✓ done233h09mlog
forky-ppc64el✓ done233h14mlog
plucky-amd64✓ done233h07mlog
plucky-arm64✓ done232h45mlog
publish✓ done232h44mlog
questing-amd64✓ done233h08mlog
questing-arm64✓ done232h51mlog
resolute-amd64✓ done233h09mlog
resolute-arm64✓ done232h57mlog
source✓ done233h21mlog
trixie-amd64✓ done233h12mlog
trixie-arm64✓ done233h03mlog
trixie-ppc64el✓ done233h11mlog
unstable-amd64✓ done233h18mlog
unstable-arm64✓ done233h15mlog
unstable-ppc64el✓ done233h17mlog

17/17 done

8e6613cec5f3649b5495e3301fa30b844575a5ca

jobstatusage
forky-amd64✓ done257h11mlog
forky-arm64✓ done257h04mlog
forky-ppc64el✓ done257h09mlog
plucky-amd64✓ done257h03mlog
plucky-arm64✓ done256h40mlog
publish✓ done256h39mlog
questing-amd64✓ done257h03mlog
questing-arm64✓ done256h46mlog
resolute-amd64✓ done257h06mlog
resolute-arm64✓ done256h52mlog
source✓ done257h16mlog
trixie-amd64✓ done257h09mlog
trixie-arm64✓ done256h58mlog
trixie-ppc64el✓ done257h05mlog
unstable-amd64✓ done257h13mlog
unstable-arm64✓ done257h10mlog
unstable-ppc64el✓ done257h12mlog

17/17 done

1098e5d778ef5c0be68f4350aa1c032a88668723

jobstatusage
forky-amd64✓ done283h02mlog
forky-arm64✓ done282h56mlog
forky-ppc64el✓ done283h01mlog
plucky-amd64✓ done282h54mlog
plucky-arm64✓ done282h32mlog
publish✓ done282h31mlog
questing-amd64✓ done282h56mlog
questing-arm64✓ done282h38mlog
resolute-amd64✓ done282h56mlog
resolute-arm64✓ done282h44mlog
source✓ done283h08mlog
trixie-amd64✓ done282h59mlog
trixie-arm64✓ done282h50mlog
trixie-ppc64el✓ done282h58mlog
unstable-amd64✓ done283h05mlog
unstable-arm64✓ done283h02mlog
unstable-ppc64el✓ done283h04mlog

17/17 done

v1.39.7

jobstatusage
forky-amd64✓ done283h40mlog
forky-arm64✓ done283h34mlog
forky-ppc64el✓ done283h39mlog
plucky-amd64✓ done283h32mlog
plucky-arm64✓ done283h10mlog
publish✓ done283h09mlog
questing-amd64✓ done283h33mlog
questing-arm64✓ done283h16mlog
resolute-amd64✓ done283h34mlog
resolute-arm64✓ done283h22mlog
source✓ done283h46mlog
trixie-amd64✓ done283h37mlog
trixie-arm64✓ done283h28mlog
trixie-ppc64el✓ done283h36mlog
unstable-amd64✓ done283h43mlog
unstable-arm64✓ done283h40mlog
unstable-ppc64el✓ done283h42mlog

17/17 done

159dd19e744c597d8bcd42de5952a32b76db36b3

jobstatusage
forky-amd64✓ done298h26mlog
forky-arm64✓ done298h22mlog
forky-ppc64el✓ done298h25mlog
plucky-amd64✓ done298h15mlog
plucky-arm64✓ done297h58mlog
publish✓ done297h57mlog
questing-amd64✓ done298h18mlog
questing-arm64✓ done298h04mlog
resolute-amd64✓ done298h18mlog
resolute-arm64✓ done298h10mlog
source✓ done298h34mlog
trixie-amd64✓ done298h22mlog
trixie-arm64✓ done298h16mlog
trixie-ppc64el✓ done298h21mlog
unstable-amd64✓ done298h30mlog
unstable-arm64✓ done298h28mlog
unstable-ppc64el✓ done298h29mlog

17/17 done

e382de4e02cdc653dfecff9f181b97aeba27401d

jobstatusage
forky-amd64✓ done304h55mlog
forky-arm64✓ done304h48mlog
forky-ppc64el✓ done304h53mlog
plucky-amd64✓ done304h47mlog
plucky-arm64✓ done304h24mlog
publish✓ done304h23mlog
questing-amd64✓ done304h47mlog
questing-arm64✓ done304h30mlog
resolute-amd64✓ done304h50mlog
resolute-arm64✓ done304h36mlog
source✓ done305h00mlog
trixie-amd64✓ done304h53mlog
trixie-arm64✓ done304h42mlog
trixie-ppc64el✓ done304h50mlog
unstable-amd64✓ done304h57mlog
unstable-arm64✓ done304h54mlog
unstable-ppc64el✓ done304h56mlog

17/17 done

d83b0b74f91f362e52415d5024b652f7c20d16d9

jobstatusage
forky-amd64✓ done324h40mlog
forky-arm64✓ done324h35mlog
forky-ppc64el✓ done324h38mlog
plucky-amd64✓ done324h31mlog
plucky-arm64✓ done324h11mlog
publish✓ done324h10mlog
questing-amd64✓ done324h31mlog
questing-arm64✓ done324h17mlog
resolute-amd64✓ done324h34mlog
resolute-arm64✓ done324h23mlog
source✓ done324h48mlog
trixie-amd64✓ done324h37mlog
trixie-arm64✓ done324h29mlog
trixie-ppc64el✓ done324h34mlog
unstable-amd64✓ done324h44mlog
unstable-arm64✓ done324h42mlog
unstable-ppc64el✓ done324h43mlog

17/17 done

a8474492ea0e68a54b9370d5ca7d379f028715bc

jobstatusage
forky-amd64✓ done330h21mlog
forky-arm64✓ done330h14mlog
forky-ppc64el✓ done330h19mlog
plucky-amd64✓ done330h13mlog
plucky-arm64✓ done329h49mlog
publish✓ done329h48mlog
questing-amd64✓ done330h13mlog
questing-arm64✓ done329h55mlog
resolute-amd64✓ done330h15mlog
resolute-arm64✓ done330h01mlog
source✓ done330h27mlog
trixie-amd64✓ done330h18mlog
trixie-arm64✓ done330h08mlog
trixie-ppc64el✓ done330h16mlog
unstable-amd64✓ done330h24mlog
unstable-arm64✓ done330h20mlog
unstable-ppc64el✓ done330h23mlog

17/17 done

f0057fc95b7aab01f4394d6e98963def71985e26

jobstatusage
forky-amd64✓ done332h24mlog
forky-arm64✓ done332h14mlog
forky-ppc64el✓ done332h23mlog
plucky-amd64✓ done332h16mlog
plucky-arm64✓ done331h50mlog
publish✓ done331h49mlog
questing-amd64✓ done332h18mlog
questing-arm64✓ done331h56mlog
resolute-amd64✓ done332h18mlog
resolute-arm64✓ done332h02mlog
source✓ done332h31mlog
trixie-amd64✓ done332h21mlog
trixie-arm64✓ done332h08mlog
trixie-ppc64el✓ done332h20mlog
unstable-amd64✓ done332h27mlog
unstable-arm64✓ done332h22mlog
unstable-ppc64el✓ done332h26mlog

17/17 done

df7b9d8aeb507c0a3d36d7938a4af6d7b6715dd9

jobstatusage
forky-amd64✓ done360h30mlog
forky-arm64✓ done360h23mlog
forky-ppc64el✓ done360h28mlog
plucky-amd64✓ done360h20mlog
plucky-arm64✓ done359h59mlog
publish✓ done359h58mlog
questing-amd64✓ done360h20mlog
questing-arm64✓ done360h05mlog
resolute-amd64✓ done360h23mlog
resolute-arm64✓ done360h11mlog
source✓ done360h36mlog
trixie-amd64✓ done360h27mlog
trixie-arm64✓ done360h17mlog
trixie-ppc64el✓ done360h23mlog
unstable-amd64✓ done360h33mlog
unstable-arm64✓ done360h30mlog
unstable-ppc64el✓ done360h32mlog

17/17 done

updated 2026-10-16 11:33 UTC · refreshes every 30s